Toybrick

编译下载的1126 kernel失败,使用的编译器也是从wiki教程里.....

chendejun

中级会员

积分
211
发表于 2021-9-8 10:51:22    查看: 2627|回复: 1 | [复制链接]    打印 | 显示全部楼层
  AS      arch/arm/boot/compressed/head.o
  LZO     arch/arm/boot/compressed/piggy_data
/bin/sh: 1: lzop: not found
arch/arm/boot/compressed/Makefile:191: recipe for target 'arch/arm/boot/compressed/piggy_data' failed
make[2]: *** [arch/arm/boot/compressed/piggy_data] Error 1
make[2]: *** 正在等待未完成的任务....
make[2]: *** wait: 没有子进程。 停止。
arch/arm/boot/Makefile:71: recipe for target 'arch/arm/boot/compressed/vmlinux' failed
make[1]: *** [arch/arm/boot/compressed/vmlinux] Error 2
arch/arm/Makefile:351: recipe for target 'zImage' failed
make: *** [zImage] Error 2
cp: 无法获取'arch/arm/boot/zImage' 的文件状态(stat): 没有那个文件或目录
./make-linux.sh: 行 196: genext2fs: 未找到命令

回复

使用道具 举报

chendejun

中级会员

积分
211
 楼主| 发表于 2021-9-8 10:53:48 | 显示全部楼层
sudo apt-get install lzop
回复

使用道具 举报

您需要登录后才可以回帖 登录 | 立即注册

本版积分规则

产品中心 购买渠道 开源社区 Wiki教程 资料下载 关于Toybrick


快速回复 返回顶部 返回列表