Toybrick

关于使用rga库中出现的报错

lozenyin

注册会员

积分
89
发表于 2022-4-18 18:14:48    查看: 1981|回复: 0 | [复制链接]    打印 | 显示全部楼层
在连接过程中报一下错误

  1. Scanning dependencies of target rk3588_rga_demo
  2. [ 50%] Building C object CMakeFiles/rk3588_rga_demo.dir/main.c.o
  3. [100%] Linking C executable rk3588_rga_demo
  4. /usr/bin/ld: CMakeFiles/rk3588_rga_demo.dir/main.c.o: in function `main':
  5. main.c:(.text.startup+0x2c): undefined reference to `get_bpp_from_format'
  6. /usr/bin/ld: main.c:(.text.startup+0x4c): undefined reference to `get_bpp_from_format'
  7. /usr/bin/ld: main.c:(.text.startup+0xd8): undefined reference to `get_buf_from_file'
  8. collect2: error: ld returned 1 exit status
  9. make[2]: *** [CMakeFiles/rk3588_rga_demo.dir/build.make:103:rk3588_rga_demo] 错误 1
  10. make[1]: *** [CMakeFiles/Makefile2:95:CMakeFiles/rk3588_rga_demo.dir/all] 错误 2
  11. make: *** [Makefile:103:all] 错误 2
复制代码
本人只使用一个librga库,对照librga的例程来写的,请教一下大概是什么方向出现问题了?
回复

使用道具 举报

您需要登录后才可以回帖 登录 | 立即注册

本版积分规则

产品中心 购买渠道 开源社区 Wiki教程 资料下载 关于Toybrick


快速回复 返回顶部 返回列表