Toybrick

1126ds kernel编译报错问题

qwqw

注册会员

积分
79
发表于 2022-5-2 15:09:52    查看: 1931|回复: 1 | [复制链接]    打印 | 显示全部楼层
/bin/sh: 1: lzop: not found
make[2]: *** [arch/arm/boot/compressed/Makefile:191:arch/arm/boot/compressed/piggy_data] 错误 1
make[1]: *** [arch/arm/boot/Makefile:71:arch/arm/boot/compressed/vmlinux] 错误 2
make: *** [arch/arm/Makefile:351:zImage] 错误 2
cp: 无法获取'arch/arm/boot/zImage' 的文件状态(stat): 没有那个文件或目录
报这些错误,如何解决?

回复

使用道具 举报

qwqw

注册会员

积分
79
 楼主| 发表于 2022-5-3 14:21:48 | 显示全部楼层
已解决,安装lzop即可
回复

使用道具 举报

您需要登录后才可以回帖 登录 | 立即注册

本版积分规则

产品中心 购买渠道 开源社区 Wiki教程 资料下载 关于Toybrick


快速回复 返回顶部 返回列表