Toybrick

编译缺少文件

9454002@qq.com

新手上路

积分
13
发表于 2022-5-6 17:45:21    查看: 2135|回复: 5 | [复制链接]    打印 | 显示全部楼层
kernel在编译的时候出现错误,源码是github下载的
回复

使用道具 举报

9454002@qq.com

新手上路

积分
13
 楼主| 发表于 2022-5-6 17:46:14 | 显示全部楼层
#
# configuration written to .config
#
/usr/bin/env: ‘python’: No such file or directory
scripts/kconfig/conf  --silentoldconfig Kconfig
/usr/bin/env: ‘python’: No such file or directory
  CHK     include/config/kernel.release
  CHK     include/generated/uapi/linux/version.h
  CC      scripts/mod/empty.o
  CHK     include/generated/utsrelease.h
  CC      scripts/mod/devicetable-offsets.s
/usr/bin/env: ‘python’: No such file or directory
make[2]: *** [scripts/Makefile.build:278: scripts/mod/empty.o] Error 127
make[2]: *** Waiting for unfinished jobs....
/usr/bin/env: ‘python’: No such file or directory
make[2]: *** [scripts/Makefile.build:153: scripts/mod/devicetable-offsets.s] Error 127
make[1]: *** [scripts/Makefile.build:484: scripts/mod] Error 2
make[1]: *** Waiting for unfinished jobs....
make: *** [Makefile:590: scripts] Error 2
make: *** Waiting for unfinished jobs....
/usr/bin/env: ‘python’: No such file or directory
  CHK     include/config/kernel.release
  CHK     include/generated/uapi/linux/version.h
  CC      scripts/mod/empty.o
/usr/bin/env: ‘python’: No such file or directory
  CC      scripts/mod/devicetable-offsets.s
make[2]: *** [scripts/Makefile.build:278: scripts/mod/empty.o] Error 127
make[2]: *** Waiting for unfinished jobs....
  CHK     include/generated/utsrelease.h
/usr/bin/env: ‘python’: No such file or directory
make[2]: *** [scripts/Makefile.build:153: scripts/mod/devicetable-offsets.s] Error 127
make[1]: *** [scripts/Makefile.build:484: scripts/mod] Error 2
make[1]: *** Waiting for unfinished jobs....
make: *** [Makefile:590: scripts] Error 2
make: *** Waiting for unfinished jobs....
/usr/bin/env: ‘python’: No such file or directory
  CHK     include/config/kernel.release
  CHK     include/generated/uapi/linux/version.h
  CC      scripts/mod/empty.o
/usr/bin/env: ‘python’: No such file or directory
  CC      scripts/mod/devicetable-offsets.s
  CHK     include/generated/utsrelease.h
make[2]: *** [scripts/Makefile.build:278: scripts/mod/empty.o] Error 127
make[2]: *** Waiting for unfinished jobs....
/usr/bin/env: ‘python’: No such file or directory
make[2]: *** [scripts/Makefile.build:153: scripts/mod/devicetable-offsets.s] Error 127
make[1]: *** [scripts/Makefile.build:484: scripts/mod] Error 2
make[1]: *** Waiting for unfinished jobs....
make: *** [Makefile:590: scripts] Error 2
make: *** Waiting for unfinished jobs....
cp: cannot stat 'arch/arm64/boot/dts/rockchip/rk3399pro-toybrick-prod-linux-u2.dtb': No such file or directory
cp: cannot stat 'arch/arm64/boot/dts/rockchip/rk3399pro-toybrick-prod-linux-edp.dtb': No such file or directory
cp: cannot stat 'arch/arm64/boot/dts/rockchip/rk3399pro-toybrick-prod-linux-mipi.dtb': No such file or directory
cp: cannot stat 'arch/arm64/boot/dts/rockchip/rk3399pro-toybrick-prod-linux-imx258.dtb': No such file or directory
/usr/bin/env: ‘python’: No such file or directory
  CHK     include/config/kernel.release
  CHK     include/generated/uapi/linux/version.h
  CHK     include/generated/utsrelease.h
  CC      scripts/mod/empty.o
/usr/bin/env:   CC      scripts/mod/devicetable-offsets.s
‘python’: No such file or directory
make[2]: *** [scripts/Makefile.build:278: scripts/mod/empty.o] Error 127
make[2]: *** Waiting for unfinished jobs....
/usr/bin/env: ‘python’: No such file or directory
make[2]: *** [scripts/Makefile.build:153: scripts/mod/devicetable-offsets.s] Error 127
make[1]: *** [scripts/Makefile.build:484: scripts/mod] Error 2
make[1]: *** Waiting for unfinished jobs....
make: *** [Makefile:590: scripts] Error 2
make: *** Waiting for unfinished jobs....
/usr/bin/env: ‘python’: No such file or directory
  CHK     include/config/kernel.release
  CHK     include/generated/uapi/linux/version.h
  CC      scripts/mod/empty.o
/usr/bin/env: ‘python’  CC      scripts/mod/devicetable-offsets.s
: No such file or directory
make[2]: *** [scripts/Makefile.build:278: scripts/mod/empty.o] Error 127
make[2]: *** Waiting for unfinished jobs....
/usr/bin/env: ‘python’: No such file or directory
make[2]: *** [scripts/Makefile.build:153: scripts/mod/devicetable-offsets.s] Error 127
make[1]: *** [scripts/Makefile.build:484: scripts/mod] Error 2
make[1]: *** Waiting for unfinished jobs....
  CHK     include/generated/utsrelease.h
make: *** [Makefile:590: scripts] Error 2
make: *** Waiting for unfinished jobs....
cp: cannot stat 'arch/arm64/boot/dts/rockchip/rk3399pro-toybrick-prod-linux.dtb': No such file or directory
cp: cannot stat 'arch/arm64/boot/dts/rockchip/rk3399pro-toybrick-prod-linux.dtb': No such file or directory
cp: cannot stat 'arch/arm64/boot/Image': No such file or directory
./make.sh: line 98: genext2fs: command not found
回复

使用道具 举报

jefferyzhang

版主

积分
13007
发表于 2022-5-6 17:50:42 | 显示全部楼层
/usr/bin/env: ‘python’: No such file or directory
回复

使用道具 举报

9454002@qq.com

新手上路

积分
13
 楼主| 发表于 2022-5-6 17:56:47 | 显示全部楼层
TB-RK3399ProD 支持Android和Linux双系统,支持双系统启动和一键切换功能怎么切换呢?
回复

使用道具 举报

9454002@qq.com

新手上路

积分
13
 楼主| 发表于 2022-5-6 18:04:09 | 显示全部楼层
make[2]: 'include/generated/vdso-offsets.h' is up to date.
  Building modules, stage 2.
  MODPOST 3 modules
  Image:  resource.img (with rk3399pro-toybrick-prod-linux.dtb logo.bmp logo_kernel.bmp) is ready
  Image:  boot.img (with Image  resource.img) is ready
  Image:  zboot.img (with Image.lz4  resource.img) is ready
./make.sh: line 98: genext2fs: command not found
回复

使用道具 举报

jefferyzhang

版主

积分
13007
发表于 2022-5-6 18:06:42 | 显示全部楼层
9454002@qq.com 发表于 2022-5-6 18:04
make[2]: 'include/generated/vdso-offsets.h' is up to date.
  Building modules, stage 2.
  MODPOST 3  ...

./make.sh: line 98: genext2fs: command not found

你是真的一点英文都看不懂呀。。。
回复

使用道具 举报

您需要登录后才可以回帖 登录 | 立即注册

本版积分规则

产品中心 购买渠道 开源社区 Wiki教程 资料下载 关于Toybrick


快速回复 返回顶部 返回列表