Toybrick

3399pro 自带Linux系统中编译demo失败

ronyuzhang

注册会员

积分
73
发表于 2019-3-20 15:12:33    查看: 6719|回复: 2 | [复制链接]    打印 | 显示全部楼层

错误如下:

[ 25%] Building CXX object CMakeFiles/rknn_mobilenet.dir/rknn_mobilenet.cpp.o
make[2]:aarch64-linux-gnu-g++:命令未找到
make[2]: *** [CMakeFiles/rknn_mobilenet.dir/build.make:63:CMakeFiles/rknn_mobilenet.dir/rknn_mobilenet.cpp.o] 错误 127
make[1]: *** [CMakeFiles/Makefile2:68:CMakeFiles/rknn_mobilenet.dir/all] 错误 2
make: *** [Makefile:84:all] 错误 2

似乎是没有aarch64-linux-gnu-g++,但是我按照教程安装了
gcc 和g++ 了呀,例如:sudo dnf install
-
y gcc gcc
-
c
++。




回复

使用道具 举报

771488533

注册会员

积分
174
发表于 2019-3-20 15:27:40 | 显示全部楼层
编译器换一下,用aarch64-redhat-linux-gcc / aarch64-redhat-linux-g++
回复

使用道具 举报

程子

中级会员

积分
386
发表于 2019-3-20 19:53:02 | 显示全部楼层
如果你在板子上编译,则不需要交叉编译器,直接使用 gcc / g++ 。
回复

使用道具 举报

您需要登录后才可以回帖 登录 | 立即注册

本版积分规则

产品中心 购买渠道 开源社区 Wiki教程 资料下载 关于Toybrick


快速回复 返回顶部 返回列表